BDBM50288376 CHEMBL4177188
SMILES Cc1cnc(Nc2cc(cc(c2)S(C)(=O)=O)N2CCN(CCO)CC2)nc1Nc1cccc(CO)c1
InChI Key InChIKey=JXKXLONPZIKKBR-UHFFFAOYSA-N
Data  3 IC50  1 EC50
  Tab Delimited (TSV)   2D SDfile   Computed 3D by Vconf -m prep SDfile
Find this compound or compounds like it in BindingDB:
Activity Spreadsheet -- Enzyme Inhibition Constant Data from BindingDB
Found 2 hits for monomerid = 50288376
TargetTyrosine-protein kinase JAK1(Homo sapiens (Human))
Astrazeneca
Curated by ChEMBL
LigandPNGBDBM50288376(CHEMBL4177188)
Affinity DataEC50: >3.00E+3nM. Assay description: Inhibition of JAK1 in human NCI-H1975 cells assessed as reduction in STAT3 phosphorylation after 1 hr by ELISA
In DepthDetails ArticlePubMed
TargetTyrosine-protein kinase JAK1(Homo sapiens (Human))
Astrazeneca
Curated by ChEMBL
LigandPNGBDBM50288376(CHEMBL4177188)
Affinity DataIC50:  6nM. Assay description: GRAC: human p38a selective inhibitor
In DepthDetails ArticlePubMed